Reaction Details
TargetMacrophage colony-stimulating factor 1 receptor
LigandBDBM98635
Substrate/Competitorn/a
Meas. Tech.Fluorescence Polarization Competition Assay
pH7.5±0
IC50 1.4±n/a nM
Citation Illig, CRChen, JMeegalia, SKWall, MJ Inhibitors of c-fms kinase US Patent US8497376 Publication Date 7/30/2013
 
Macrophage colony-stimulating factor 1 receptor
Name:Macrophage colony-stimulating factor 1 receptor
Type:Protein
Mol. Mass.:109173.45
Organism:Mus musculus (Mouse)
Description:P09581
Residue:977
BDBM98635
NameBDBM98635
Synonyms:US8497376, 16
TypeSmall organic molecule
Emp. Form.C25H31N5O2
Mol. Mass.433.5459
SMILESCC1(C)CC(CC(C)(C)O1)c1ccc(NC(=O)c2ncc([nH]2)C#N)c(n1)C1=CCCCC1