Reaction Details
TargetMacrophage colony-stimulating factor 1 receptor
LigandBDBM98643
Substrate/Competitorn/a
Meas. Tech.Fluorescence Polarization Competition Assay
pH7.5±0
IC50 2.9±n/a nM
Citation Illig, CRChen, JMeegalia, SKWall, MJ Inhibitors of c-fms kinase US Patent US8497376 Publication Date 7/30/2013
 
Macrophage colony-stimulating factor 1 receptor
Name:Macrophage colony-stimulating factor 1 receptor
Type:Protein
Mol. Mass.:109173.45
Organism:Mus musculus (Mouse)
Description:P09581
Residue:977
BDBM98643
NameBDBM98643
Synonyms:US8497376, 19
TypeSmall organic molecule
Emp. Form.C25H29N5O4
Mol. Mass.463.5289
SMILESC[C@@]12CC(C[C@@](C)(O1)[C@@H](O)[C@H]2O)c1ccc(NC(=O)c2ncc([nH]2)C#N)c(n1)C1=CCCCC1