Reaction Details
TargetBeta-lactamase
LigandBDBM98855
Substrate/CompetitorBDBM98856
Meas. Tech.Spectrophotometric Assay
IC50 10±0.0 nM
Citation Blizzard, TAChen, HGude, CHermes, JDImbriglio, JKim, SWu, JYMortko, CJMangion, IRivera, NRuck, RTShevlin, M Beta-lactamase inhibitors US Patent US8487093 Publication Date 7/16/2013
 
Beta-lactamase
Name:Beta-lactamase
Synonyms:Beta-lactamase (KPC-2)
Type:Enzyme
Mol. Mass.:27537.23
Organism:Klebsiella pneumoniae
Description:I7AKP2
Residue:260
BDBM98855
BDBM98856
NameBDBM98855
Synonyms:US8487093, 18
TypeSmall organic molecule
Emp. Form.C13H21N3O7S
Mol. Mass.363.387
SMILESOS(=O)(=O)ON1C2CN([C@@H](CC2)C(=O)OCC2CCNCC2)C1=O