Reaction Details
TargetBeta-lactamase
LigandBDBM98733
Substrate/CompetitorBDBM98856
Meas. Tech.Spectrophotometric Assay
IC50 17±0.0 nM
Citation Blizzard, TAChen, HGude, CHermes, JDImbriglio, JKim, SWu, JYMortko, CJMangion, IRivera, NRuck, RTShevlin, M Beta-lactamase inhibitors US Patent US8487093 Publication Date 7/16/2013
 
Beta-lactamase
Name:Beta-lactamase
Synonyms:Beta-lactamase (KPC-2)
Type:Enzyme
Mol. Mass.:27537.23
Organism:Klebsiella pneumoniae
Description:I7AKP2
Residue:260
BDBM98733
BDBM98856
NameBDBM98733
Synonyms:US8487093, 76
TypeSmall organic molecule
Emp. Form.C10H16N4O6S
Mol. Mass.320.322
SMILESOS(=O)(=O)ON1[C@H]2CN([C@@H](CC2)C(=O)NC2CNC2)C1=O