Reaction Details
TargetBeta-lactamase
LigandBDBM98810
Substrate/CompetitorBDBM98856
Meas. Tech.Spectrophotometric Assay
IC50 10±0.0 nM
Citation Blizzard, TAChen, HGude, CHermes, JDImbriglio, JKim, SWu, JYMortko, CJMangion, IRivera, NRuck, RTShevlin, M Beta-lactamase inhibitors US Patent US8487093 Publication Date 7/16/2013
 
Beta-lactamase
Name:Beta-lactamase
Synonyms:Beta-lactamase (KPC-2)
Type:Enzyme
Mol. Mass.:27537.23
Organism:Klebsiella pneumoniae
Description:I7AKP2
Residue:260
BDBM98810
BDBM98856
NameBDBM98810
Synonyms:US8487093, 200
TypeSmall organic molecule
Emp. Form.C16H21N5O6S
Mol. Mass.411.433
SMILESOS(=O)(=O)ON1[C@H]2CN([C@@H](CC2)C(=O)Nc2ccc(cn2)N2CCCC2)C1=O