Reaction Details
TargetBeta-lactamase
LigandBDBM98831
Substrate/CompetitorBDBM98856
Meas. Tech.Spectrophotometric Assay
IC50 4±0.0 nM
Citation Blizzard, TAChen, HGude, CHermes, JDImbriglio, JKim, SWu, JYMortko, CJMangion, IRivera, NRuck, RTShevlin, M Beta-lactamase inhibitors US Patent US8487093 Publication Date 7/16/2013
 
Beta-lactamase
Name:Beta-lactamase
Synonyms:Beta-lactamase (KPC-2)
Type:Enzyme
Mol. Mass.:27537.23
Organism:Klebsiella pneumoniae
Description:I7AKP2
Residue:260
BDBM98831
BDBM98856
NameBDBM98831
Synonyms:US8487093, 236
TypeSmall organic molecule
Emp. Form.C12H18FN3O7S
Mol. Mass.367.351
SMILESOS(=O)(=O)ON1[C@H]2CN([C@@H](CC2)C(=O)O[C@H]2CCNC[C@@H]2F)C1=O