Reaction Details
TargetBeta-lactamase
LigandBDBM98841
Substrate/CompetitorBDBM98856
Meas. Tech.Spectrophotometric Assay
IC50 30±0.0 nM
Citation Blizzard, TAChen, HGude, CHermes, JDImbriglio, JKim, SWu, JYMortko, CJMangion, IRivera, NRuck, RTShevlin, M Beta-lactamase inhibitors US Patent US8487093 Publication Date 7/16/2013
 
Beta-lactamase
Name:Beta-lactamase
Synonyms:Beta-lactamase (KPC-2)
Type:Enzyme
Mol. Mass.:27537.23
Organism:Klebsiella pneumoniae
Description:I7AKP2
Residue:260
BDBM98841
BDBM98856
NameBDBM98841
Synonyms:US8487093, 256
TypeSmall organic molecule
Emp. Form.C9H15N3O7S
Mol. Mass.309.296
SMILESNCCOC(=O)[C@@H]1CC[C@@H]2CN1C(=O)N2OS(O)(=O)=O