Reaction Details
TargetBeta-lactamase
LigandBDBM98792
Substrate/CompetitorBDBM98856
Meas. Tech.Spectrophotometric Assay
IC50 1.2±0.0 nM
Citation Blizzard, TAChen, HGude, CHermes, JDImbriglio, JKim, SWu, JYMortko, CJMangion, IRivera, NRuck, RTShevlin, M Beta-lactamase inhibitors US Patent US8487093 Publication Date 7/16/2013
 
Beta-lactamase
Name:Beta-lactamase
Synonyms:Beta-lactamase (AmpC)
Type:Enzyme
Mol. Mass.:43489.98
Organism:Pseudomonas aeruginosa
Description:Q3LG62
Residue:397
BDBM98792
BDBM98856
NameBDBM98792
Synonyms:US8487093, 180
TypeSmall organic molecule
Emp. Form.C12H14N4O6S
Mol. Mass.342.328
SMILESOS(=O)(=O)ON1[C@H]2CN([C@@H](CC2)C(=O)Nc2ccccn2)C1=O