Reaction Details
TargetBeta-lactamase
LigandBDBM98808
Substrate/CompetitorBDBM98856
Meas. Tech.Spectrophotometric Assay
IC50 5±0.0 nM
Citation Blizzard, TAChen, HGude, CHermes, JDImbriglio, JKim, SWu, JYMortko, CJMangion, IRivera, NRuck, RTShevlin, M Beta-lactamase inhibitors US Patent US8487093 Publication Date 7/16/2013
 
Beta-lactamase
Name:Beta-lactamase
Synonyms:Beta-lactamase (AmpC)
Type:Enzyme
Mol. Mass.:43489.98
Organism:Pseudomonas aeruginosa
Description:Q3LG62
Residue:397
BDBM98808
BDBM98856
NameBDBM98808
Synonyms:US8487093, 198
TypeSmall organic molecule
Emp. Form.C16H21N5O7S
Mol. Mass.427.432
SMILESOS(=O)(=O)ON1[C@H]2CN([C@@H](CC2)C(=O)Nc2ccc(cn2)N2CCOCC2)C1=O