Reaction Details
TargetTyrosine-protein kinase JAK2
LigandBDBM99550
Substrate/Competitorn/a
Meas. Tech.In Vitro Enzyme Assay
IC50 0.7±0.0 nM
Citation Curry, MADorsey, BDDugan, BJGingrich, DEMesaros, EFMilkiewicz, KL Preparation and uses of 1,2,4-triazolo [1,5a] pyridine derivatives US Patent US8501936 Publication Date 8/6/2013
 
Tyrosine-protein kinase JAK2
Name:Tyrosine-protein kinase JAK2
Type:Protein
Mol. Mass.:130684.68
Organism:Homo sapiens (Human)
Description:O60674
Residue:1132
BDBM99550
NameBDBM99550
Synonyms:US8501936, 48
TypeSmall organic molecule
Emp. Form.C25H28N6O2S
Mol. Mass.476.594
SMILESCN1CCN(CC1)c1ccc(Nc2nc3c(cccn3n2)-c2ccc(CS(C)(=O)=O)cc2)cc1