Reaction Details
TargetTyrosine-protein kinase JAK2
LigandBDBM99582
Substrate/Competitorn/a
Meas. Tech.In Vitro Enzyme Assay
IC50 6.9±0.0 nM
Citation Curry, MADorsey, BDDugan, BJGingrich, DEMesaros, EFMilkiewicz, KL Preparation and uses of 1,2,4-triazolo [1,5a] pyridine derivatives US Patent US8501936 Publication Date 8/6/2013
 
Tyrosine-protein kinase JAK2
Name:Tyrosine-protein kinase JAK2
Type:Protein
Mol. Mass.:130684.68
Organism:Homo sapiens (Human)
Description:O60674
Residue:1132
BDBM99582
NameBDBM99582
Synonyms:US8501936, 81
TypeSmall organic molecule
Emp. Form.C24H26N6O2S
Mol. Mass.462.567
SMILESCN1CCN(CC1)c1ccc(Nc2nc3cccc(-c4ccc(cc4)S(C)(=O)=O)n3n2)cc1