Reaction Details
TargetTyrosine-protein kinase JAK2
LigandBDBM99614
Substrate/Competitorn/a
Meas. Tech.In Vitro Enzyme Assay
IC50 0.66±0.0 nM
Citation Curry, MADorsey, BDDugan, BJGingrich, DEMesaros, EFMilkiewicz, KL Preparation and uses of 1,2,4-triazolo [1,5a] pyridine derivatives US Patent US8501936 Publication Date 8/6/2013
 
Tyrosine-protein kinase JAK2
Name:Tyrosine-protein kinase JAK2
Type:Protein
Mol. Mass.:130684.68
Organism:Homo sapiens (Human)
Description:O60674
Residue:1132
BDBM99614
NameBDBM99614
Synonyms:US8501936, 115
TypeSmall organic molecule
Emp. Form.C24H25N5O4S2
Mol. Mass.511.616
SMILESCS(=O)(=O)c1ccc(cc1)-c1cccc2nc(Nc3ccc(CN4CCS(=O)(=O)CC4)cc3)nn12