Reaction Details
TargetCathepsin K
LigandBDBM100301
Substrate/Competitorn/a
Meas. Tech.In Vitro Inhibition Assay
Ki 0.8±0.0 nM
Citation Quibell, MWatts, JP Piperazine compounds US Patent US8501744 Publication Date 8/6/2013
 
Cathepsin K
Name:Cathepsin K
Type:Enzyme
Mol. Mass.:36975.68
Organism:Homo sapiens (Human)
Description:P43235
Residue:329
BDBM100301
NameBDBM100301
Synonyms:US8501744, 26
TypeSmall organic molecule
Emp. Form.C27H40N4O4
Mol. Mass.484.6309
SMILESCC(C)[C@H]1CN([C@H]2[C@@H]1OCC2=O)C(=O)[C@@H](NC(=O)c1ccc(cc1)N1CCN(C)CC1)C(C)(C)C