Reaction Details
TargetC-X-C chemokine receptor type 2
LigandBDBM100342
Substrate/Competitorn/a
Meas. Tech.Calcium Fluorescence Assay (FLIPR)
IC50 1.76e+3±n/a nM
Citation Hachtel, SDedio, JDeFossa, EGrueneberg, SHeitsch, HBock, WChen, CKosley, RKung, CPatek, MSher, RShimshock, SWeichsel, A CXCR2 inhibitors US Patent US8501981 Publication Date 8/6/2013
 
C-X-C chemokine receptor type 2
Name:C-X-C chemokine receptor type 2
Type:Protein
Mol. Mass.:40767.88
Organism:Homo sapiens (Human)
Description:P25025
Residue:360
BDBM100342
NameBDBM100342
Synonyms:US8501981, 46
TypeSmall organic molecule
Emp. Form.C21H21NO5S
Mol. Mass.399.46
SMILESCC(C)(NC(=O)c1sc2ccccc2c1OCCOc1ccccc1)C(O)=O