Reaction Details
TargetC-X-C chemokine receptor type 2
LigandBDBM100343
Substrate/Competitorn/a
Meas. Tech.Calcium Fluorescence Assay (FLIPR)
IC50 9.2e+2±n/a nM
Citation Hachtel, SDedio, JDeFossa, EGrueneberg, SHeitsch, HBock, WChen, CKosley, RKung, CPatek, MSher, RShimshock, SWeichsel, A CXCR2 inhibitors US Patent US8501981 Publication Date 8/6/2013
 
C-X-C chemokine receptor type 2
Name:C-X-C chemokine receptor type 2
Type:Protein
Mol. Mass.:40767.88
Organism:Homo sapiens (Human)
Description:P25025
Residue:360
BDBM100343
NameBDBM100343
Synonyms:US8501981, 52
TypeSmall organic molecule
Emp. Form.C27H29NO4
Mol. Mass.431.5235
SMILESCC(CCc1ccccc1)Oc1c(ccc2ccccc12)C(=O)NC1(CCCC1)C(O)=O