Reaction Details
TargetC-X-C chemokine receptor type 2
LigandBDBM100344
Substrate/Competitorn/a
Meas. Tech.Calcium Fluorescence Assay (FLIPR)
IC50 2.56e+3±n/a nM
Citation Hachtel, SDedio, JDeFossa, EGrueneberg, SHeitsch, HBock, WChen, CKosley, RKung, CPatek, MSher, RShimshock, SWeichsel, A CXCR2 inhibitors US Patent US8501981 Publication Date 8/6/2013
 
C-X-C chemokine receptor type 2
Name:C-X-C chemokine receptor type 2
Type:Protein
Mol. Mass.:40767.88
Organism:Homo sapiens (Human)
Description:P25025
Residue:360
BDBM100344
NameBDBM100344
Synonyms:US8501981, 55
TypeSmall organic molecule
Emp. Form.C26H29NO5
Mol. Mass.435.5122
SMILESCC(C)CC(C)(NC(=O)c1ccc2ccccc2c1OCCOc1ccccc1)C(O)=O