Reaction Details
TargetC-X-C chemokine receptor type 2
LigandBDBM100346
Substrate/Competitorn/a
Meas. Tech.Calcium Fluorescence Assay (FLIPR)
IC50 3.23e+3±n/a nM
Citation Hachtel, SDedio, JDeFossa, EGrueneberg, SHeitsch, HBock, WChen, CKosley, RKung, CPatek, MSher, RShimshock, SWeichsel, A CXCR2 inhibitors US Patent US8501981 Publication Date 8/6/2013
 
C-X-C chemokine receptor type 2
Name:C-X-C chemokine receptor type 2
Type:Protein
Mol. Mass.:40767.88
Organism:Homo sapiens (Human)
Description:P25025
Residue:360
BDBM100346
NameBDBM100346
Synonyms:US8501981, 105
TypeSmall organic molecule
Emp. Form.C24H22FNO5
Mol. Mass.423.4336
SMILESOC(=O)C1(CCC1)NC(=O)c1ccc2ccccc2c1OCCOc1ccc(F)cc1