Reaction Details
TargetMonoglyceride lipase
LigandBDBM280506
Substrate/Competitorn/a
Meas. Tech.In Vitro Competitive Activity-Based Protein Profiling
IC50<100±n/a nM
Citation Cisar, JSGrice, CAJones, TKWeber, ODBuzard, DJShaghafi, MB Spirocycle compounds and methods of making and using same US Patent US10030020 Publication Date 7/24/2018
 
Monoglyceride lipase
Name:Monoglyceride lipase
Type:Hydrolase
Mol. Mass.:33391.67
Organism:Mus musculus (mouse)
Description:Assays were using membranes of recombinant MAG Lipase transiently transfected in COS-7 cells.
Residue:303
BDBM280506
NameBDBM280506
Synonyms:US10030020, Example 51 | US10781211, Example 51
TypeSmall organic molecule
Emp. Form.C26H32F9N3O3
Mol. Mass.605.5362
SMILESCC1(C)CC2(CN1Cc1ccc(cc1N1CCOCC1)C(F)(F)F)CCN(CC2)C(=O)OC(C(F)(F)F)C(F)(F)F