Reaction Details
TargetMonoacylglycerol lipase ABHD2
LigandBDBM280509
Substrate/Competitorn/a
Meas. Tech.In Vitro Competitive Activity-Based Protein Profiling
IC50>1000±n/a nM
Citation Cisar, JSGrice, CAJones, TKWeber, ODBuzard, DJShaghafi, MB Spirocycle compounds and methods of making and using same US Patent US10030020 Publication Date 7/24/2018
 
Monoacylglycerol lipase ABHD2
Name:Monoacylglycerol lipase ABHD2
Type:Enzyme Catalytic Domain
Mol. Mass.:48378.90
Organism:Mus musculus (Mouse)
Description:n/a
Residue:425
BDBM280509
NameBDBM280509
Synonyms:US10030020, Example 54 | US10781211, Example 54
TypeSmall organic molecule
Emp. Form.C25H32ClF6N3O3
Mol. Mass.571.983
SMILESCC1(C)CC2(CN1Cc1cccc(Cl)c1N1CCOCC1)CCN(CC2)C(=O)OC(C(F)(F)F)C(F)(F)F