Reaction Details
TargetMonoglyceride lipase
LigandBDBM280568
Substrate/Competitorn/a
Meas. Tech.In Vitro Competitive Activity-Based Protein Profiling
IC50<100±n/a nM
Citation Cisar, JSGrice, CAJones, TKWeber, ODBuzard, DJShaghafi, MB Spirocycle compounds and methods of making and using same US Patent US10030020 Publication Date 7/24/2018
 
Monoglyceride lipase
Name:Monoglyceride lipase
Type:Hydrolase
Mol. Mass.:33391.67
Organism:Mus musculus (mouse)
Description:Assays were using membranes of recombinant MAG Lipase transiently transfected in COS-7 cells.
Residue:303
BDBM280568
NameBDBM280568
Synonyms:US10030020, Example 113 | US10781211, Example 113
TypeSmall organic molecule
Emp. Form.C24H31ClF6N4O4S
Mol. Mass.621.036
SMILESFC(F)(F)C(OC(=O)N1CCC2(CCCN2Cc2cccc(N3CCN(CS(=O)=O)CC3)c2Cl)CC1)C(F)(F)F