Reaction Details
TargetMonoglyceride lipase
LigandBDBM280571
Substrate/Competitorn/a
Meas. Tech.In Vitro Competitive Activity-Based Protein Profiling
IC50<100±n/a nM
Citation Cisar, JSGrice, CAJones, TKWeber, ODBuzard, DJShaghafi, MB Spirocycle compounds and methods of making and using same US Patent US10030020 Publication Date 7/24/2018
 
Monoglyceride lipase
Name:Monoglyceride lipase
Type:Hydrolase
Mol. Mass.:33391.67
Organism:Mus musculus (mouse)
Description:Assays were using membranes of recombinant MAG Lipase transiently transfected in COS-7 cells.
Residue:303
BDBM280571
NameBDBM280571
Synonyms:US10030020, Example 116 | US10781211, Example 116
TypeSmall organic molecule
Emp. Form.C25H33ClF6N4O2
Mol. Mass.570.999
SMILESCCN1CCN(CC1)c1cccc(CN2CCCC22CCN(CC2)C(=O)OC(C(F)(F)F)C(F)(F)F)c1Cl