Reaction Details
TargetMonoglyceride lipase
LigandBDBM280577
Substrate/Competitorn/a
Meas. Tech.In Vitro Competitive Activity-Based Protein Profiling (Human)
Temperature298.15±n/a K
IC50<100±n/a nM
Commentsextracted
Citation Cisar, JSGrice, CAJones, TKWeber, ODBuzard, DJShaghafi, MB Spirocycle compounds and methods of making and using same US Patent US10030020 Publication Date 7/24/2018
 
Monoglyceride lipase
Name:Monoglyceride lipase
Type:Hydrolase
Mol. Mass.:33264.56
Organism:Homo sapiens (Human)
Description:Human recombinant MGL (Cayman Chemical, cat# 10008354).
Residue:303
BDBM280577
NameBDBM280577
Synonyms:US10030020, Example 122 | US10781211, Example 122
TypeSmall organic molecule
Emp. Form.C25H30ClF6N3O4
Mol. Mass.585.967
SMILESOC(=O)C1CCN(CC1)c1cc(Cl)cc(CN2CCCC22CCN(CC2)C(=O)OC(C(F)(F)F)C(F)(F)F)c1