Reaction Details
TargetMonoacylglycerol lipase ABHD2
LigandBDBM280588
Substrate/Competitorn/a
Meas. Tech.In Vitro Competitive Activity-Based Protein Profiling
IC50>1000±n/a nM
Citation Cisar, JSGrice, CAJones, TKWeber, ODBuzard, DJShaghafi, MB Spirocycle compounds and methods of making and using same US Patent US10030020 Publication Date 7/24/2018
 
Monoacylglycerol lipase ABHD2
Name:Monoacylglycerol lipase ABHD2
Type:Enzyme Catalytic Domain
Mol. Mass.:48378.90
Organism:Mus musculus (Mouse)
Description:n/a
Residue:425
BDBM280588
NameBDBM280588
Synonyms:US10030020, Example 133 | US10781211, Example 133
TypeSmall organic molecule
Emp. Form.C24H28F9N3O3
Mol. Mass.577.483
SMILESFC(F)(F)C(OC(=O)N1CCC2(CCCN2Cc2ccc(c(c2)N2CCOCC2)C(F)(F)F)CC1)C(F)(F)F