Reaction Details
TargetMonoglyceride lipase
LigandBDBM280595
Substrate/Competitorn/a
Meas. Tech.In Vitro Competitive Activity-Based Protein Profiling
IC50<100±n/a nM
Citation Cisar, JSGrice, CAJones, TKWeber, ODBuzard, DJShaghafi, MB Spirocycle compounds and methods of making and using same US Patent US10030020 Publication Date 7/24/2018
 
Monoglyceride lipase
Name:Monoglyceride lipase
Type:Hydrolase
Mol. Mass.:33391.67
Organism:Mus musculus (mouse)
Description:Assays were using membranes of recombinant MAG Lipase transiently transfected in COS-7 cells.
Residue:303
BDBM280595
NameBDBM280595
Synonyms:US10030020, Example 140 | US10781211, Example 140
TypeSmall organic molecule
Emp. Form.C24H28F9N3O3
Mol. Mass.577.483
SMILESFC(F)(F)C(OC(=O)N1CCC2(CCN(Cc3ccc(N4CCOCC4)c(c3)C(F)(F)F)C2)CC1)C(F)(F)F