Reaction Details
TargetAmine oxidase [flavin-containing] B
LigandBDBM101302
Substrate/Competitorn/a
Meas. Tech.Biological Assay
Ki>4.0e+4±n/a nM
Citation Guibourt, NMunoz, AOLaria, JC Oxidase inhibitors and their use US Patent US8524717 Publication Date 9/3/2013
 
Amine oxidase [flavin-containing] B
Name:Amine oxidase [flavin-containing] B
Type:Protein
Mol. Mass.:58768.76
Organism:Homo sapiens (Human)
Description:P27338
Residue:520
BDBM101302
NameBDBM101302
Synonyms:CHEMBL3108900 | US8524717, 57
TypeSmall organic molecule
Emp. Form.C23H25F4N3O
Mol. Mass.435.4577
SMILESCN1CCN(CC1)C(=O)CN[C@H]1C[C@@H]1c1ccc(cc1)-c1cc(F)ccc1C(F)(F)F