Reaction Details
TargetSerine/threonine-protein kinase PAK 4
LigandBDBM101547
Substrate/Competitorn/a
Meas. Tech.Enzymatic Assay
Ki 3.6±n/a nM
EC50<3.9±0.0 nM
Citation Zhang, JGuo, CBouzida, DDong, LLi, HMarakovits, JTYang, AHong, Y Pyrrolopyrazoles, potent kinase inhibitors US Patent US8530652 Publication Date 9/10/2013
 
Serine/threonine-protein kinase PAK 4
Name:Serine/threonine-protein kinase PAK 4
Type:Protein
Mol. Mass.:64098.01
Organism:Homo sapiens (Human)
Description:O96013
Residue:591
BDBM101547
NameBDBM101547
Synonyms:US8530494, 212 US8530652, 74
TypeSmall organic molecule
Emp. Form.C27H28N8O2
Mol. Mass.496.5636
SMILESCN(C)C[C@@H](OC(=O)N1Cc2c(Nc3nc(nc4ccccc34)C#N)[nH]nc2C1(C)C)c1ccccc1