Reaction Details
TargetSerine/threonine-protein kinase PAK 4
LigandBDBM101549
Substrate/Competitorn/a
Meas. Tech.Enzymatic Assay
Ki 8.3±n/a nM
EC50<3.9±0.0 nM
Citation Zhang, JGuo, CBouzida, DDong, LLi, HMarakovits, JTYang, AHong, Y Pyrrolopyrazoles, potent kinase inhibitors US Patent US8530652 Publication Date 9/10/2013
 
Serine/threonine-protein kinase PAK 4
Name:Serine/threonine-protein kinase PAK 4
Type:Protein
Mol. Mass.:64098.01
Organism:Homo sapiens (Human)
Description:O96013
Residue:591
BDBM101549
NameBDBM101549
Synonyms:US8530494, 109 US8530652, 76
TypeSmall organic molecule
Emp. Form.C23H26F3N7O2
Mol. Mass.489.4934
SMILESCN(C)C[C@@H](OC(=O)N1Cc2c(Nc3ccnc(n3)C(F)(F)F)[nH]nc2C1(C)C)c1ccccc1