Reaction Details
TargetDeoxyuridine 5'-triphosphate nucleotidohydrolase, mitochondrial
LigandBDBM101778
Substrate/Competitorn/a
Meas. Tech.Inhibition Assay
IC50 3e+1±n/a nM
Citation Fukuoka, MYokogawa, TMiyahara, SMiyakoshi, HYano, WTaguchi, JTakao, Y Uracil compound or salt thereof having human deoxyuridine triphosphatase inhibitory activity US Patent US8530490 Publication Date 9/10/2013
 
Deoxyuridine 5'-triphosphate nucleotidohydrolase, mitochondrial
Name:Deoxyuridine 5'-triphosphate nucleotidohydrolase, mitochondrial
Type:Enzyme
Mol. Mass.:26574.03
Organism:Homo sapiens (Human)
Description:P33316
Residue:252
BDBM101778
NameBDBM101778
Synonyms:US8530490, 38
TypeSmall organic molecule
Emp. Form.C23H26FN3O6S2
Mol. Mass.523.597
SMILESFc1ccc(cc1OCC1CC1)[C@H](NS(=O)(=O)CCCOCn1ccc(=O)[nH]c1=O)c1cccs1