Reaction Details
TargetDeoxyuridine 5'-triphosphate nucleotidohydrolase, mitochondrial
LigandBDBM101907
Substrate/Competitorn/a
Meas. Tech.Inhibition Assay
IC50 1.1e+2±n/a nM
Citation Fukuoka, MYokogawa, TMiyahara, SMiyakoshi, HYano, WTaguchi, JTakao, Y Uracil compound or salt thereof having human deoxyuridine triphosphatase inhibitory activity US Patent US8530490 Publication Date 9/10/2013
 
Deoxyuridine 5'-triphosphate nucleotidohydrolase, mitochondrial
Name:Deoxyuridine 5'-triphosphate nucleotidohydrolase, mitochondrial
Type:Enzyme
Mol. Mass.:26574.03
Organism:Homo sapiens (Human)
Description:P33316
Residue:252
BDBM101907
NameBDBM101907
Synonyms:US8530490, 179
TypeSmall organic molecule
Emp. Form.C23H26N4O5S
Mol. Mass.470.541
SMILESCC(C)(NS(=O)(=O)c1cccc(OCC2CC2)c1)c1ccc(Cn2ccc(=O)[nH]c2=O)nc1