Reaction Details
TargetDeoxyuridine 5'-triphosphate nucleotidohydrolase, mitochondrial
LigandBDBM50190553
Substrate/Competitorn/a
Meas. Tech.Inhibition Assay
IC50 1.85e+5±n/a nM
Citation Fukuoka, MYokogawa, TMiyahara, SMiyakoshi, HYano, WTaguchi, JTakao, Y Uracil compound or salt thereof having human deoxyuridine triphosphatase inhibitory activity US Patent US8530490 Publication Date 9/10/2013
 
Deoxyuridine 5'-triphosphate nucleotidohydrolase, mitochondrial
Name:Deoxyuridine 5'-triphosphate nucleotidohydrolase, mitochondrial
Type:Enzyme
Mol. Mass.:26574.03
Organism:Homo sapiens (Human)
Description:P33316
Residue:252
BDBM50190553
NameBDBM50190553
Synonyms:1-[2-(trityloxy)ethoxymethyl]uracil US8530490, Comparative 1
TypeSmall organic molecule
Emp. Form.C26H24N2O4
Mol. Mass.428.4798
SMILESO=c1ccn(COCCOC(c2ccccc2)(c2ccccc2)c2ccccc2)c(=O)[nH]1