Reaction Details
TargetIsoform 3 of Acetyl-CoA carboxylase 2 (ACC2.v2)
LigandBDBM101972
Substrate/Competitorn/a
Meas. Tech.Enzyme Assay
IC50 9e+1±n/a nM
Citation Fleck, MNosse, BHeine, NRoth, GJ Azetidine derivatives US Patent US8530460 Publication Date 9/10/2013
 
Isoform 3 of Acetyl-CoA carboxylase 2 (ACC2.v2)
Name:Isoform 3 of Acetyl-CoA carboxylase 2 (ACC2.v2)
Type:Protein
Mol. Mass.:255085.30
Organism:Homo sapiens (Human)
Description:AJ575592.3
Residue:2256
BDBM101972
NameBDBM101972
Synonyms:US8530460, 1.52
TypeSmall organic molecule
Emp. Form.C21H27N3O3
Mol. Mass.369.4574
SMILESCCCOc1ccc(nc1)N1CC(C1)Oc1ccc(cc1)[C@H](C)NC(C)=O