Reaction Details
TargetIsoform 3 of Acetyl-CoA carboxylase 2 (ACC2.v2)
LigandBDBM101993
Substrate/Competitorn/a
Meas. Tech.Enzyme Assay
IC50 1.4e+2±n/a nM
Citation Fleck, MNosse, BHeine, NRoth, GJ Azetidine derivatives US Patent US8530460 Publication Date 9/10/2013
 
Isoform 3 of Acetyl-CoA carboxylase 2 (ACC2.v2)
Name:Isoform 3 of Acetyl-CoA carboxylase 2 (ACC2.v2)
Type:Protein
Mol. Mass.:255085.30
Organism:Homo sapiens (Human)
Description:AJ575592.3
Residue:2256
BDBM101993
NameBDBM101993
Synonyms:US8530460, 2.10
TypeSmall organic molecule
Emp. Form.C23H28N2O3
Mol. Mass.380.48
SMILESCCOc1ccc(cc1)N1CC(C1)Oc1ccc(cc1)[C@H](C)NC(=O)C1CC1