Reaction Details
TargetOrexin receptor type 2
LigandBDBM102168
Substrate/Competitorn/a
Meas. Tech.FLIPR Assay
pH7.4±0
Ki 1±n/a nM
Citation Badiger, SBehnke, DBetschart, CChaudhari, VCotesta, SHinrichs, JHOfner, SPandit, CWagner, J Diaza-spiro[5.5]undecanes US Patent US8530648 Publication Date 9/10/2013
 
Orexin receptor type 2
Name:Orexin receptor type 2
Type:Protein
Mol. Mass.:50710.53
Organism:Homo sapiens (Human)
Description:O43614
Residue:444
BDBM102168
NameBDBM102168
Synonyms:US8530648, 75
TypeSmall organic molecule
Emp. Form.C26H27N5O
Mol. Mass.425.5255
SMILESO=C1CCCC2(CCN(CC2)c2cnc3ccccc3n2)N1Cc1cccc2[nH]ccc12