Reaction Details
TargetMu-type opioid receptor
LigandBDBM102402
Substrate/Competitorn/a
Meas. Tech.Binding Assay
Temperature298.15±0 K
Ki 2.7±0.0 nM
Citation Inagaki, MHara, SHaga, NTamura, YGoto, YHasegawa, T 6,7-unsaturated-7-carbamoyl substituted morphinan derivative US Patent US8536192 Publication Date 9/17/2013
 
Mu-type opioid receptor
Name:Mu-type opioid receptor
Type:G Protein-Coupled Receptor (GPCR)
Mol. Mass.:44503.11
Organism:Rattus norvegicus (rat)
Description:Competition binding assays were carried out using membrane preparations from transfected HN9.10 cells that constitutively expressed the mu opioid receptor.
Residue:398
BDBM102402
NameBDBM102402
Synonyms:US8536192, I-122
TypeSmall organic molecule
Emp. Form.C27H27ClN2O7S
Mol. Mass.559.03
SMILESOC1=C(C[C@@]2(O)[C@H]3Cc4ccc(O)c5O[C@@H]1[C@]2(CCN3CC1CC1)c45)C(=O)NS(=O)(=O)c1cccc(Cl)c1