Reaction Details
TargetMu-type opioid receptor
LigandBDBM102418
Substrate/Competitorn/a
Meas. Tech.Binding Assay
Temperature298.15±0 K
Ki 1.13±0.0 nM
Citation Inagaki, MHara, SHaga, NTamura, YGoto, YHasegawa, T 6,7-unsaturated-7-carbamoyl substituted morphinan derivative US Patent US8536192 Publication Date 9/17/2013
 
Mu-type opioid receptor
Name:Mu-type opioid receptor
Type:G Protein-Coupled Receptor (GPCR)
Mol. Mass.:44503.11
Organism:Rattus norvegicus (rat)
Description:Competition binding assays were carried out using membrane preparations from transfected HN9.10 cells that constitutively expressed the mu opioid receptor.
Residue:398
BDBM102418
NameBDBM102418
Synonyms:US8536192, I-284
TypeSmall organic molecule
Emp. Form.C32H34N4O6
Mol. Mass.570.6356
SMILESCC(C)(NC(=O)C1C[C@@]2(O)[C@H]3Cc4ccc(O)c5O[C@@H](C1=O)[C@]2(CCN3CC1CC1)c45)c1nc(no1)-c1ccccc1