Reaction Details
TargetFibroblast growth factor receptor 3
LigandBDBM102526
Substrate/Competitorn/a
Meas. Tech.Kinase Assay
IC50 7±0.0 nM
Citation Furet, PGraus Porta, DGuagnano, V Quinoxaline carboxamide derivatives as protein tyrosine kinase inhibitors US Patent US8536175 Publication Date 9/17/2013
 
Fibroblast growth factor receptor 3
Name:Fibroblast growth factor receptor 3
Type:Protein
Mol. Mass.:87699.57
Organism:Homo sapiens (Human)
Description:P22607
Residue:806
BDBM102526
NameBDBM102526
Synonyms:US8536175, 93
TypeSmall organic molecule
Emp. Form.C25H24F2N6O3
Mol. Mass.494.4933
SMILESCOc1cc(OC)c(F)c(c1F)-c1ccc(C(=O)Nc2ncc(CN3CCCC3)[nH]2)c2nccnc12