Reaction Details
TargetMitogen-activated protein kinase 8
LigandBDBM102563
Substrate/Competitorn/a
Meas. Tech.In Vitro Inhibition Assay
pH7.5±0
IC50 3.1±n/a nM
Citation Gong, LHan, XMakra, FPalmer, WSRaptova, L Inhibitors of JNK US Patent US8536172 Publication Date 9/17/2013
 
Mitogen-activated protein kinase 8
Name:Mitogen-activated protein kinase 8
Type:Enzyme
Mol. Mass.:48297.57
Organism:Homo sapiens (Human)
Description:JNK-1 was purchased from Upstate Cell Signaling Solutions (formerly Upstate Biotechnology).
Residue:427
BDBM102563
NameBDBM102563
Synonyms:US8536172, I-12
TypeSmall organic molecule
Emp. Form.C24H31N5O3S
Mol. Mass.469.6
SMILESCS(=O)(=O)C1CCN(CC1)c1cccc2n(ccc12)-c1ccnc(N[C@H]2CC[C@H](O)CC2)n1