Reaction Details
TargetMitogen-activated protein kinase 8
LigandBDBM102562
Substrate/Competitorn/a
Meas. Tech.In Vitro Inhibition Assay
pH7.5±0
IC50 68.1±n/a nM
Citation Gong, LHan, XMakra, FPalmer, WSRaptova, L Inhibitors of JNK US Patent US8536172 Publication Date 9/17/2013
 
Mitogen-activated protein kinase 8
Name:Mitogen-activated protein kinase 8
Type:Enzyme
Mol. Mass.:48297.57
Organism:Homo sapiens (Human)
Description:JNK-1 was purchased from Upstate Cell Signaling Solutions (formerly Upstate Biotechnology).
Residue:427
BDBM102562
NameBDBM102562
Synonyms:US8536172, I-11
TypeSmall organic molecule
Emp. Form.C25H33N7O4S
Mol. Mass.527.639
SMILESCS(=O)(=O)N[C@H]1CC[C@@H](CC1)Nc1nccc(n1)-n1ccc2c(cccc12)N1CCN(CC1)C(=O)CO