Reaction Details
TargetTyrosine-protein kinase BTK
LigandBDBM102620
Substrate/Competitorn/a
IC50 10.4±0.0 nM
Citation Liu, FZhang, XWeisberg, EChen, SHur, WWu, HZhao, ZWang, WMao, MCai, CSimon, NISanda, TWang, JLook, ATGriffin, JDBalk, SPLiu, QGray, NS Discovery of a Selective Irreversible BMX Inhibitor for Prostate Cancer. ACS Chem Biol8:1423-8 (2013) 
 
Tyrosine-protein kinase BTK
Name:Tyrosine-protein kinase BTK
Type:Enzyme
Mol. Mass.:76289.95
Organism:Homo sapiens (Human)
Description:Q06187
Residue:659
BDBM102620
NameBDBM102620
Synonyms:BMX-IN-1 US10000483, Compound I-14
TypeSmall organic molecule
Emp. Form.C29H24N4O4S
Mol. Mass.524.59
SMILESCc1ccc(cc1NC(=O)C=C)-n1c2c(ccc1=O)cnc1ccc(cc21)-c1ccc(NS(C)(=O)=O)cc1