Reaction Details
TargetTyrosine-protein kinase JAK3 [1-973]
LigandBDBM102620
Substrate/Competitorn/a
IC50 175±0.0 nM
Citation Liu, FZhang, XWeisberg, EChen, SHur, WWu, HZhao, ZWang, WMao, MCai, CSimon, NISanda, TWang, JLook, ATGriffin, JDBalk, SPLiu, QGray, NS Discovery of a Selective Irreversible BMX Inhibitor for Prostate Cancer. ACS Chem Biol8:1423-8 (2013) 
 
Tyrosine-protein kinase JAK3 [1-973]
Name:Tyrosine-protein kinase JAK3 [1-973]
Type:Protein
Mol. Mass.:108094.44
Organism:Homo sapiens (Human)
Description:P52333[1-973] modified
Residue:973
BDBM102620
NameBDBM102620
Synonyms:BMX-IN-1 US10000483, Compound I-14
TypeSmall organic molecule
Emp. Form.C29H24N4O4S
Mol. Mass.524.59
SMILESCc1ccc(cc1NC(=O)C=C)-n1c2c(ccc1=O)cnc1ccc(cc21)-c1ccc(NS(C)(=O)=O)cc1