Reaction Details
TargetTumor necrosis factor
LigandBDBM102736
Substrate/Competitorn/a
Meas. Tech.Inhibition Assay
Ki 0.18±0 nM
IC50 86±0.0 nM
Citation Kozlowski, JAYu, WWong, MKKim, SHTong, LLavey, BJShankar, BBYang, DFeltz, RKosinski, AMZhou, GRizvi, RKDai, CFire, LGirijavallabhan, VLi, DPopovici-Muller, JRichard, JERosner, KESiddiqui, MAYang, L Compounds for the treatment of inflammatory disorders US Patent US8541572 Publication Date 9/24/2013
 
Tumor necrosis factor
Name:Tumor necrosis factor
Type:Enzyme
Mol. Mass.:25645.11
Organism:Homo sapiens (Human)
Description:P01375
Residue:233
BDBM102736
NameBDBM102736
Synonyms:US8541572, 1907
TypeSmall organic molecule
Emp. Form.C27H27FN6O5
Mol. Mass.534.5389
SMILESCOc1ccc2CN(C[C@]3(NC(=O)NC3=O)C#Cc3cncc(NC(=O)C4CCN(C)CC4)c3)C(=O)c2c1F