Reaction Details
TargetTumor necrosis factor
LigandBDBM102738
Substrate/Competitorn/a
Meas. Tech.Inhibition Assay
Ki 0.17±0 nM
IC50 78±0.0 nM
Citation Kozlowski, JAYu, WWong, MKKim, SHTong, LLavey, BJShankar, BBYang, DFeltz, RKosinski, AMZhou, GRizvi, RKDai, CFire, LGirijavallabhan, VLi, DPopovici-Muller, JRichard, JERosner, KESiddiqui, MAYang, L Compounds for the treatment of inflammatory disorders US Patent US8541572 Publication Date 9/24/2013
 
Tumor necrosis factor
Name:Tumor necrosis factor
Type:Enzyme
Mol. Mass.:25645.11
Organism:Homo sapiens (Human)
Description:P01375
Residue:233
BDBM102738
NameBDBM102738
Synonyms:US8541572, 1909
TypeSmall organic molecule
Emp. Form.C28H29N5O5
Mol. Mass.515.5604
SMILESCOc1ccc2CN(C[C@]3(NC(=O)NC3=O)C#Cc3ccc(NC(=O)C4CCN(C)CC4)cc3)C(=O)c2c1