Reaction Details
TargetTumor necrosis factor
LigandBDBM102856
Substrate/Competitorn/a
Meas. Tech.Inhibition Assay
Ki 0.17±0.0 nM
IC50 86±0.0 nM
Citation Kozlowski, JAYu, WWong, MKKim, SHTong, LLavey, BJShankar, BBYang, DFeltz, RKosinski, AMZhou, GRizvi, RKDai, CFire, LGirijavallabhan, VLi, DPopovici-Muller, JRichard, JERosner, KESiddiqui, MAYang, L Compounds for the treatment of inflammatory disorders US Patent US8541572 Publication Date 9/24/2013
 
Tumor necrosis factor
Name:Tumor necrosis factor
Type:Enzyme
Mol. Mass.:25645.11
Organism:Homo sapiens (Human)
Description:P01375
Residue:233
BDBM102856
NameBDBM102856
Synonyms:US8541572, 945
TypeSmall organic molecule
Emp. Form.C27H25N5O6
Mol. Mass.515.5173
SMILESCOc1ccc2CN(C[C@]3(NC(=O)NC3=O)C#Cc3ccc(cc3)C(N=O)N3CCC(=O)CC3)C(=O)c2c1