Reaction Details
TargetTumor necrosis factor
LigandBDBM102858
Substrate/Competitorn/a
Meas. Tech.Inhibition Assay
Ki 0.12±0.0 nM
IC50 220±0.0 nM
Citation Kozlowski, JAYu, WWong, MKKim, SHTong, LLavey, BJShankar, BBYang, DFeltz, RKosinski, AMZhou, GRizvi, RKDai, CFire, LGirijavallabhan, VLi, DPopovici-Muller, JRichard, JERosner, KESiddiqui, MAYang, L Compounds for the treatment of inflammatory disorders US Patent US8541572 Publication Date 9/24/2013
 
Tumor necrosis factor
Name:Tumor necrosis factor
Type:Enzyme
Mol. Mass.:25645.11
Organism:Homo sapiens (Human)
Description:P01375
Residue:233
BDBM102858
NameBDBM102858
Synonyms:US8541572, 951
TypeSmall organic molecule
Emp. Form.C25H26N6O5S
Mol. Mass.522.576
SMILESCOc1ccc2CN(C[C@]3(NC(=O)NC3=O)C#Cc3ccc(s3)C(N=O)N3CCN(C)CC3)C(=O)c2c1