Reaction Details
TargetProcathepsin L
LigandBDBM103352
Substrate/Competitorn/a
Meas. Tech.In Vitro Inhibition Assay
Ki>10000±0.0 nM
Citation Quibell, MWatts, JPFlinn, NS Furo[3, 2-B] pyrrol-3-ones as cathespin S inhibitors US Patent US8552202 Publication Date 10/8/2013
 
Procathepsin L
Name:Procathepsin L
Type:Enzyme
Mol. Mass.:37557.19
Organism:Homo sapiens (Human)
Description:Purchased from Calbiochem (San Diego, CA).
Residue:333
BDBM103352
NameBDBM103352
Synonyms:US8552202, Compound 4
TypeSmall organic molecules
Emp. Form.C22H28N2O4
Mol. Mass.384.4687
SMILESC[C@H]1CCC(CC1)[C@H](NC(=O)c1ccccc1)C(=O)N1CC[C@H]2OCC(=O)[C@@H]12