Reaction Details
TargetCathepsin L2
LigandBDBM103348
Substrate/Competitorn/a
Meas. Tech.In Vitro Inhibition Assay
Ki 5700±0.0 nM
Citation Quibell, MWatts, JPFlinn, NS Furo[3, 2-B] pyrrol-3-ones as cathespin S inhibitors US Patent US8552202 Publication Date 10/8/2013
 
Cathepsin L2
Name:Cathepsin L2
Type:Enzyme
Mol. Mass.:37341.06
Organism:Homo sapiens (Human)
Description:O60911
Residue:334
BDBM103348
NameBDBM103348
Synonyms:US8552202, 63
TypeSmall organic molecules
Emp. Form.C22H28N2O4
Mol. Mass.384.4687
SMILESO=C(N[C@@H](CC1CCCCC1)C(=O)N1CC[C@H]2OCC(=O)[C@@H]12)c1ccccc1