Reaction Details
TargetTyrosine-protein kinase ZAP-70
LigandBDBM103510
Substrate/Competitorn/a
Meas. Tech.Enzyme Assay
IC50 58±n/a nM
Citation Okram, BUno, TDing, QLiu, YJin, YJin, QWu, XChe, JYan, SFHao, X Compounds and compositions as kinase inhibitors US Patent US8546370 Publication Date 10/1/2013
 
Tyrosine-protein kinase ZAP-70
Name:Tyrosine-protein kinase ZAP-70
Type:Enzyme
Mol. Mass.:69881.61
Organism:Homo sapiens (Human)
Description:ZAP-70 SH2 domain was expressed and purified from E. coli using O-phospho-L-tyrosine-agarose column.
Residue:619
BDBM103510
NameBDBM103510
Synonyms:US8546370, 11
TypeSmall organic molecule
Emp. Form.C24H22N4O2
Mol. Mass.398.4571
SMILESO=c1[nH]ccc2cc(nc(Nc3ccc(cc3)N3CCOCC3)c12)-c1ccccc1