Reaction Details
TargetSerine/threonine-protein kinase B-raf [V600E]
LigandBDBM103675
Substrate/Competitorn/a
Meas. Tech.Raf/Mek Amplified Luminescence Proximity Homogeneous Assay
pH7.5±0
IC50 0.29±n/a nM
Citation Costales, AQHuang, SJin, JXLiu, ZPecchi, SPoon, DTellew, J Compounds and compositions as protein kinase inhibitors US Patent US8563553 Publication Date 10/22/2013
 
Serine/threonine-protein kinase B-raf [V600E]
Name:Serine/threonine-protein kinase B-raf [V600E]
Type:n/a
Mol. Mass.:84474.98
Organism:Homo sapiens (Human)
Description:P15056 V600E
Residue:766
BDBM103675
NameBDBM103675
Synonyms:US8563553, 100
TypeSmall organic molecule
Emp. Form.C22H24ClN7O2S
Mol. Mass.485.99
SMILESCc1cc(NS(C)(=O)=O)c(Cl)c(c1)-c1[nH]c(nc1-c1ccnc(NCCC#N)n1)C1(C)CC1