Reaction Details
TargetSerine/threonine-protein kinase B-raf [V600E]
LigandBDBM103663
Substrate/Competitorn/a
Meas. Tech.Raf/Mek Amplified Luminescence Proximity Homogeneous Assay
pH7.5±0
IC50 0.39±n/a nM
Citation Costales, AQHuang, SJin, JXLiu, ZPecchi, SPoon, DTellew, J Compounds and compositions as protein kinase inhibitors US Patent US8563553 Publication Date 10/22/2013
 
Serine/threonine-protein kinase B-raf [V600E]
Name:Serine/threonine-protein kinase B-raf [V600E]
Type:n/a
Mol. Mass.:84474.98
Organism:Homo sapiens (Human)
Description:P15056 V600E
Residue:766
BDBM103663
NameBDBM103663
Synonyms:US8563553, 88
TypeSmall organic molecule
Emp. Form.C22H26ClFN6O2S
Mol. Mass.492.997
SMILESCCCNc1nccc(n1)-c1nc([nH]c1-c1cc(F)cc(NS(=O)(=O)CCC)c1Cl)C1CC1