Reaction Details
TargetMembrane primary amine oxidase
LigandBDBM103942
Substrate/CompetitorBDBM10999
Meas. Tech.Biological Assay
Temperature298.15±n/a K
IC50 91±0.0 nM
Commentsextracted
Citation Savory, EHigginbottom, MOliver, KHorgan, VA Methods of using 4, 5, 6, 7-tetrahydroimidazo-[4,5-c]pyridine compounds US Patent US8569338 Publication Date 10/29/2013
 
Membrane primary amine oxidase
Name:Membrane primary amine oxidase
Type:Protein
Mol. Mass.:84620.86
Organism:Homo sapiens (Human)
Description:Q16853
Residue:763
BDBM103942
BDBM10999
NameBDBM103942
Synonyms:US10399973, Example 17 US9035066, 17 US9890160, Example 17
TypeSmall organic molecule
Emp. Form.C15H23N3O3
Mol. Mass.293.3614
SMILESCC(C)C1N(CCc2nc[nH]c12)C(=O)OCC1CCOC1